{"text_format":"3","workbook":"xlsx","n_sheets":2,"sheets":["教师岗","管理岗"],"not_rendered":{"external_links":1,"defined_names":2},"read":"whole","date_system":"1900"}

{"sheet":"教师岗","index":0,"n_rows":638,"n_cols":18,"rows_kept":638}
["序号","岗位代码","岗位编号","准考证号","笔试成绩","备注"]
[1,4000405,"JX202401","JX202401001",70,"入围专业测试"]
[2,4000405,"JX202401","JX202401002",69,"入围专业测试"]
[3,4000406,"JX202402","JX202402034",75,"入围专业测试"]
[4,4000406,"JX202402","JX202402032",73,"入围专业测试"]
[5,4000406,"JX202402","JX202402027",72,"入围专业测试"]
[6,4000406,"JX202402","JX202402018",70,"入围专业测试"]
[7,4000406,"JX202402","JX202402021",69,"入围专业测试"]
[8,4000406,"JX202402","JX202402028",69,"入围专业测试"]
[9,4000406,"JX202402","JX202402039",68.5,"入围专业测试"]
[10,4000406,"JX202402","JX202402016",68,"入围专业测试"]
[11,4000406,"JX202402","JX202402022",68,"入围专业测试"]
[12,4000406,"JX202402","JX202402007",67.5]
[13,4000406,"JX202402","JX202402030",67.5]
[14,4000406,"JX202402","JX202402004",67]
[15,4000406,"JX202402","JX202402008",66]
[16,4000406,"JX202402","JX202402029",65]
[17,4000406,"JX202402","JX202402006",64]
[18,4000406,"JX202402","JX202402009",64]
[19,4000406,"JX202402","JX202402013",64]
[20,4000406,"JX202402","JX202402019",63.5]
[21,4000406,"JX202402","JX202402023",61]
[22,4000406,"JX202402","JX202402020",57]
[23,4000406,"JX202402","JX202402011",55.5]
[24,4000407,"DQ202401","DQ202401002",77,"入围专业测试"]
[25,4000407,"DQ202401","DQ202401038",76.5,"入围专业测试"]
[26,4000407,"DQ202401","DQ202401049",75,"入围专业测试"]
[27,4000407,"DQ202401","DQ202401014",74.5,"入围专业测试"]
[28,4000407,"DQ202401","DQ202401017",74,"入围专业测试"]
[29,4000407,"DQ202401","DQ202401018",73.5,"入围专业测试"]
[30,4000407,"DQ202401","DQ202401054",72,"入围专业测试"]
[31,4000407,"DQ202401","DQ202401023",72,"入围专业测试"]
[32,4000407,"DQ202401","DQ202401035",71.5,"入围专业测试"]
[33,4000407,"DQ202401","DQ202401007",71,"入围专业测试"]
[34,4000407,"DQ202401","DQ202401019",71,"入围专业测试"]
[35,4000407,"DQ202401","DQ202401027",70.5,"入围专业测试"]
[36,4000407,"DQ202401","DQ202401040",70,"入围专业测试"]
[37,4000407,"DQ202401","DQ202401004",69.5,"入围专业测试"]
[38,4000407,"DQ202401","DQ202401016",69.5,"入围专业测试"]
[39,4000407,"DQ202401","DQ202401026",69.5,"入围专业测试"]
[40,4000407,"DQ202401","DQ202401046",69.5,"入围专业测试"]
[41,4000407,"DQ202401","DQ202401033",69]
[42,4000407,"DQ202401","DQ202401043",69]
[43,4000407,"DQ202401","DQ202401032",68.5]
[44,4000407,"DQ202401","DQ202401042",68]
[45,4000407,"DQ202401","DQ202401003",67]
[46,4000407,"DQ202401","DQ202401047",67]
[47,4000407,"DQ202401","DQ202401030",66]
[48,4000407,"DQ202401","DQ202401045",65.5]
[49,4000407,"DQ202401","DQ202401050",65.5]
[50,4000407,"DQ202401","DQ202401021",64.5]
[51,4000407,"DQ202401","DQ202401015",63.5]
[52,4000407,"DQ202401","DQ202401034",63.5]
[53,4000407,"DQ202401","DQ202401041",63.5]
[54,4000407,"DQ202401","DQ202401011",63]
[55,4000407,"DQ202401","DQ202401052",63]
[56,4000407,"DQ202401","DQ202401024",62]
[57,4000407,"DQ202401","DQ202401037",62]
[58,4000407,"DQ202401","DQ202401009",61.5]
[59,4000407,"DQ202401","DQ202401025",61.5]
[60,4000407,"DQ202401","DQ202401048",60]
[61,4000407,"DQ202401","DQ202401020",50]
[62,4000408,"DQ202402","DQ202402006",79,"入围专业测试"]
[63,4000408,"DQ202402","DQ202402007",77,"入围专业测试"]
[64,4000408,"DQ202402","DQ202402005",73,"入围专业测试"]
[65,4000408,"DQ202402","DQ202402001",71.5,"入围专业测试"]
[66,4000408,"DQ202402","DQ202402003",65,"入围专业测试"]
[67,4000409,"DQ202403","DQ202403022",81.5,"入围专业测试"]
[68,4000409,"DQ202403","DQ202403029",77.5,"入围专业测试"]
[69,4000409,"DQ202403","DQ202403030",77.5,"入围专业测试"]
[70,4000409,"DQ202403","DQ202403033",75,"入围专业测试"]
[71,4000409,"DQ202403","DQ202403012",72,"入围专业测试"]
[72,4000409,"DQ202403","DQ202403034",72,"入围专业测试"]
[73,4000409,"DQ202403","DQ202403007",71]
[74,4000409,"DQ202403","DQ202403008",70]
[75,4000409,"DQ202403","DQ202403020",70]
[76,4000409,"DQ202403","DQ202403005",69.5]
[77,4000409,"DQ202403","DQ202403035",69.5]
[78,4000409,"DQ202403","DQ202403024",68]
[79,4000409,"DQ202403","DQ202403021",67.5]
[80,4000409,"DQ202403","DQ202403038",67]
[81,4000409,"DQ202403","DQ202403039",67]
[82,4000409,"DQ202403","DQ202403046",67]
[83,4000409,"DQ202403","DQ202403026",66.5]
[84,4000409,"DQ202403","DQ202403002",66]
[85,4000409,"DQ202403","DQ202403006",66]
[86,4000409,"DQ202403","DQ202403027",66]
[87,4000409,"DQ202403","DQ202403018",65.5]
[88,4000409,"DQ202403","DQ202403049",64.5]
[89,4000409,"DQ202403","DQ202403050",64]
[90,4000409,"DQ202403","DQ202403040",63]
[91,4000409,"DQ202403","DQ202403045",61]
[92,4000409,"DQ202403","DQ202403009",60.5]
[93,4000409,"DQ202403","DQ202403028",60]
[94,4000409,"DQ202403","DQ202403025",56]
[95,4000410,"DQ202404","DQ202404001",71,"入围专业测试"]
[96,4000411,"HLW202401","HLW202401004",80,"入围专业测试"]
[97,4000411,"HLW202401","HLW202401089",80,"入围专业测试"]
[98,4000411,"HLW202401","HLW202401100",77.5,"入围专业测试"]
[99,4000411,"HLW202401","HLW202401122",77,"入围专业测试"]
[100,4000411,"HLW202401","HLW202401044",76.5,"入围专业测试"]
[101,4000411,"HLW202401","HLW202401104",76.5,"入围专业测试"]
[102,4000411,"HLW202401","HLW202401005",76,"入围专业测试"]
[103,4000411,"HLW202401","HLW202401072",76,"入围专业测试"]
[104,4000411,"HLW202401","HLW202401115",75.5,"入围专业测试"]
[105,4000411,"HLW202401","HLW202401076",75,"入围专业测试"]
[106,4000411,"HLW202401","HLW202401092",75,"入围专业测试"]
[107,4000411,"HLW202401","HLW202401032",74.5,"入围专业测试"]
[108,4000411,"HLW202401","HLW202401090",74.5,"入围专业测试"]
[109,4000411,"HLW202401","HLW202401017",74,"入围专业测试"]
[110,4000411,"HLW202401","HLW202401060",74,"入围专业测试"]
[111,4000411,"HLW202401","HLW202401066",74,"入围专业测试"]
[112,4000411,"HLW202401","HLW202401113",74,"入围专业测试"]
[113,4000411,"HLW202401","HLW202401009",73.5]
[114,4000411,"HLW202401","HLW202401098",73.5]
[115,4000411,"HLW202401","HLW202401099",73.5]
[116,4000411,"HLW202401","HLW202401002",73]
[117,4000411,"HLW202401","HLW202401108",73]
[118,4000411,"HLW202401","HLW202401116",73]
[119,4000411,"HLW202401","HLW202401131",73]
[120,4000411,"HLW202401","HLW202401049",72.5]
[121,4000411,"HLW202401","HLW202401114",72.5]
[122,4000411,"HLW202401","HLW202401119",72.5]
[123,4000411,"HLW202401","HLW202401011",72]
[124,4000411,"HLW202401","HLW202401028",72]
[125,4000411,"HLW202401","HLW202401029",72]
[126,4000411,"HLW202401","HLW202401086",72]
[127,4000411,"HLW202401","HLW202401120",72]
[128,4000411,"HLW202401","HLW202401121",72]
[129,4000411,"HLW202401","HLW202401057",71.5]
[130,4000411,"HLW202401","HLW202401088",71.5]
[131,4000411,"HLW202401","HLW202401016",71]
[132,4000411,"HLW202401","HLW202401036",71]
[133,4000411,"HLW202401","HLW202401056",71]
[134,4000411,"HLW202401","HLW202401062",71]
[135,4000411,"HLW202401","HLW202401067",71]
[136,4000411,"HLW202401","HLW202401080",71]
[137,4000411,"HLW202401","HLW202401083",71]
[138,4000411,"HLW202401","HLW202401102",71]
[139,4000411,"HLW202401","HLW202401003",70]
[140,4000411,"HLW202401","HLW202401070",70]
[141,4000411,"HLW202401","HLW202401087",70]
[142,4000411,"HLW202401","HLW202401111",70]
[143,4000411,"HLW202401","HLW202401077",69.5]
[144,4000411,"HLW202401","HLW202401117",69.5]
[145,4000411,"HLW202401","HLW202401007",69]
[146,4000411,"HLW202401","HLW202401034",69]
[147,4000411,"HLW202401","HLW202401043",69]
[148,4000411,"HLW202401","HLW202401045",69]
[149,4000411,"HLW202401","HLW202401046",69]
[150,4000411,"HLW202401","HLW202401064",69]
[151,4000411,"HLW202401","HLW202401065",69]
[152,4000411,"HLW202401","HLW202401071",69]
[153,4000411,"HLW202401","HLW202401040",68.5]
[154,4000411,"HLW202401","HLW202401110",68.5]
[155,4000411,"HLW202401","HLW202401013",68]
[156,4000411,"HLW202401","HLW202401015",68]
[157,4000411,"HLW202401","HLW202401075",68]
[158,4000411,"HLW202401","HLW202401103",68]
[159,4000411,"HLW202401","HLW202401123",68]
[160,4000411,"HLW202401","HLW202401129",68]
[161,4000411,"HLW202401","HLW202401031",67.5]
[162,4000411,"HLW202401","HLW202401084",67.5]
[163,4000411,"HLW202401","HLW202401094",67.5]
[164,4000411,"HLW202401","HLW202401019",67]
[165,4000411,"HLW202401","HLW202401027",67]
[166,4000411,"HLW202401","HLW202401035",67]
[167,4000411,"HLW202401","HLW202401048",67]
[168,4000411,"HLW202401","HLW202401051",67]
[169,4000411,"HLW202401","HLW202401054",67]
[170,4000411,"HLW202401","HLW202401061",67]
[171,4000411,"HLW202401","HLW202401068",67]
[172,4000411,"HLW202401","HLW202401128",67]
[173,4000411,"HLW202401","HLW202401037",66.5]
[174,4000411,"HLW202401","HLW202401020",66]
[175,4000411,"HLW202401","HLW202401022",66]
[176,4000411,"HLW202401","HLW202401039",66]
[177,4000411,"HLW202401","HLW202401047",66]
[178,4000411,"HLW202401","HLW202401024",65.5]
[179,4000411,"HLW202401","HLW202401085",65.5]
[180,4000411,"HLW202401","HLW202401010",65]
[181,4000411,"HLW202401","HLW202401058",65]
[182,4000411,"HLW202401","HLW202401095",65]
[183,4000411,"HLW202401","HLW202401069",64.5]
[184,4000411,"HLW202401","HLW202401081",64.5]
[185,4000411,"HLW202401","HLW202401097",64.5]
[186,4000411,"HLW202401","HLW202401125",64.5]
[187,4000411,"HLW202401","HLW202401008",64]
[188,4000411,"HLW202401","HLW202401130",64]
[189,4000411,"HLW202401","HLW202401018",63.5]
[190,4000411,"HLW202401","HLW202401105",63.5]
[191,4000411,"HLW202401","HLW202401025",63]
[192,4000411,"HLW202401","HLW202401042",63]
[193,4000411,"HLW202401","HLW202401059",63]
[194,4000411,"HLW202401","HLW202401063",63]
[195,4000411,"HLW202401","HLW202401078",63]
[196,4000411,"HLW202401","HLW202401126",63]
[197,4000411,"HLW202401","HLW202401091",62.5]
[198,4000411,"HLW202401","HLW202401030",62]
[199,4000411,"HLW202401","HLW202401093",62]
{"$rows_left_out":439}
{"sheet":"管理岗","index":1,"n_rows":274,"n_cols":6,"rows_kept":274}
["序号","岗位代码","岗位编号","准考证号","笔试成绩","备注"]
[1,4000440,"HQ202401","HQ202401059",83.5,"入围专业测试"]
[2,4000440,"HQ202401","HQ202401023",80.5,"入围专业测试"]
[3,4000440,"HQ202401","HQ202401054",80,"入围专业测试"]
[4,4000440,"HQ202401","HQ202401021",79]
[5,4000440,"HQ202401","HQ202401026",79]
[6,4000440,"HQ202401","HQ202401005",78]
[7,4000440,"HQ202401","HQ202401007",78]
[8,4000440,"HQ202401","HQ202401014",77]
[9,4000440,"HQ202401","HQ202401016",76.5]
[10,4000440,"HQ202401","HQ202401056",76.5]
[11,4000440,"HQ202401","HQ202401065",76.5]
[12,4000440,"HQ202401","HQ202401027",76]
[13,4000440,"HQ202401","HQ202401034",76]
[14,4000440,"HQ202401","HQ202401008",75.5]
[15,4000440,"HQ202401","HQ202401055",75.5]
[16,4000440,"HQ202401","HQ202401025",75]
[17,4000440,"HQ202401","HQ202401037",75]
[18,4000440,"HQ202401","HQ202401038",75]
[19,4000440,"HQ202401","HQ202401002",74.5]
[20,4000440,"HQ202401","HQ202401009",74.5]
[21,4000440,"HQ202401","HQ202401033",74.5]
[22,4000440,"HQ202401","HQ202401067",74.5]
[23,4000440,"HQ202401","HQ202401074",74.5]
[24,4000440,"HQ202401","HQ202401076",74.5]
[25,4000440,"HQ202401","HQ202401001",74]
[26,4000440,"HQ202401","HQ202401011",74]
[27,4000440,"HQ202401","HQ202401013",74]
[28,4000440,"HQ202401","HQ202401020",74]
[29,4000440,"HQ202401","HQ202401066",74]
[30,4000440,"HQ202401","HQ202401006",73.5]
[31,4000440,"HQ202401","HQ202401028",73.5]
[32,4000440,"HQ202401","HQ202401040",73.5]
[33,4000440,"HQ202401","HQ202401050",73.5]
[34,4000440,"HQ202401","HQ202401058",73.5]
[35,4000440,"HQ202401","HQ202401019",73]
[36,4000440,"HQ202401","HQ202401022",73]
[37,4000440,"HQ202401","HQ202401024",73]
[38,4000440,"HQ202401","HQ202401044",73]
[39,4000440,"HQ202401","HQ202401047",73]
[40,4000440,"HQ202401","HQ202401053",73]
[41,4000440,"HQ202401","HQ202401051",72.5]
[42,4000440,"HQ202401","HQ202401064",72.5]
[43,4000440,"HQ202401","HQ202401071",72.5]
[44,4000440,"HQ202401","HQ202401010",72]
[45,4000440,"HQ202401","HQ202401015",71.5]
[46,4000440,"HQ202401","HQ202401018",71.5]
[47,4000440,"HQ202401","HQ202401048",71.5]
[48,4000440,"HQ202401","HQ202401061",71.5]
[49,4000440,"HQ202401","HQ202401003",71]
[50,4000440,"HQ202401","HQ202401032",71]
[51,4000440,"HQ202401","HQ202401063",71]
[52,4000440,"HQ202401","HQ202401069",71]
[53,4000440,"HQ202401","HQ202401029",70.5]
[54,4000440,"HQ202401","HQ202401072",70.5]
[55,4000440,"HQ202401","HQ202401042",70]
[56,4000440,"HQ202401","HQ202401045",70]
[57,4000440,"HQ202401","HQ202401057",70]
[58,4000440,"HQ202401","HQ202401075",70]
[59,4000440,"HQ202401","HQ202401004",69.5]
[60,4000440,"HQ202401","HQ202401035",69.5]
[61,4000440,"HQ202401","HQ202401046",69]
[62,4000440,"HQ202401","HQ202401070",69]
[63,4000440,"HQ202401","HQ202401012",68.5]
[64,4000440,"HQ202401","HQ202401052",68.5]
[65,4000440,"HQ202401","HQ202401068",68]
[66,4000440,"HQ202401","HQ202401017",67.5]
[67,4000440,"HQ202401","HQ202401073",66]
[68,4000440,"HQ202401","HQ202401062",64.5]
[69,4000440,"HQ202401","HQ202401060",64]
[70,4000440,"HQ202401","HQ202401043",61.5]
[71,4000440,"HQ202401","HQ202401041",58.5]
[72,{"$f":"VLOOKUP(C73,[1]Sheet1!$E$7:$F$46,2,0)","v":4000441},"CW202401","CW202401020",80,"入围专业测试"]
[73,{"$f":"VLOOKUP(C74,[1]Sheet1!$E$7:$F$46,2,0)","v":4000441},"CW202401","CW202401021",80,"入围专业测试"]
[74,{"$f":"VLOOKUP(C75,[1]Sheet1!$E$7:$F$46,2,0)","v":4000441},"CW202401","CW202401030",77.5,"入围专业测试"]
[75,{"$f":"VLOOKUP(C76,[1]Sheet1!$E$7:$F$46,2,0)","v":4000441},"CW202401","CW202401017",76.5]
[76,{"$f":"VLOOKUP(C77,[1]Sheet1!$E$7:$F$46,2,0)","v":4000441},"CW202401","CW202401022",76]
[77,{"$f":"VLOOKUP(C78,[1]Sheet1!$E$7:$F$46,2,0)","v":4000441},"CW202401","CW202401023",76]
[78,{"$f":"VLOOKUP(C79,[1]Sheet1!$E$7:$F$46,2,0)","v":4000441},"CW202401","CW202401029",76]
[79,{"$f":"VLOOKUP(C80,[1]Sheet1!$E$7:$F$46,2,0)","v":4000441},"CW202401","CW202401034",75.5]
[80,{"$f":"VLOOKUP(C81,[1]Sheet1!$E$7:$F$46,2,0)","v":4000441},"CW202401","CW202401014",74.5]
[81,{"$f":"VLOOKUP(C82,[1]Sheet1!$E$7:$F$46,2,0)","v":4000441},"CW202401","CW202401033",74]
[82,{"$f":"VLOOKUP(C83,[1]Sheet1!$E$7:$F$46,2,0)","v":4000441},"CW202401","CW202401001",73.5]
[83,{"$f":"VLOOKUP(C84,[1]Sheet1!$E$7:$F$46,2,0)","v":4000441},"CW202401","CW202401026",73.5]
[84,{"$f":"VLOOKUP(C85,[1]Sheet1!$E$7:$F$46,2,0)","v":4000441},"CW202401","CW202401028",73.5]
[85,{"$f":"VLOOKUP(C86,[1]Sheet1!$E$7:$F$46,2,0)","v":4000441},"CW202401","CW202401032",73]
[86,{"$f":"VLOOKUP(C87,[1]Sheet1!$E$7:$F$46,2,0)","v":4000441},"CW202401","CW202401015",72]
[87,{"$f":"VLOOKUP(C88,[1]Sheet1!$E$7:$F$46,2,0)","v":4000441},"CW202401","CW202401031",72]
[88,{"$f":"VLOOKUP(C89,[1]Sheet1!$E$7:$F$46,2,0)","v":4000441},"CW202401","CW202401007",71.5]
[89,{"$f":"VLOOKUP(C90,[1]Sheet1!$E$7:$F$46,2,0)","v":4000441},"CW202401","CW202401010",71.5]
[90,{"$f":"VLOOKUP(C91,[1]Sheet1!$E$7:$F$46,2,0)","v":4000441},"CW202401","CW202401025",71.5]
[91,{"$f":"VLOOKUP(C92,[1]Sheet1!$E$7:$F$46,2,0)","v":4000441},"CW202401","CW202401005",70]
[92,{"$f":"VLOOKUP(C93,[1]Sheet1!$E$7:$F$46,2,0)","v":4000441},"CW202401","CW202401013",70]
[93,{"$f":"VLOOKUP(C94,[1]Sheet1!$E$7:$F$46,2,0)","v":4000441},"CW202401","CW202401009",69]
[94,{"$f":"VLOOKUP(C95,[1]Sheet1!$E$7:$F$46,2,0)","v":4000441},"CW202401","CW202401036",69]
[95,{"$f":"VLOOKUP(C96,[1]Sheet1!$E$7:$F$46,2,0)","v":4000441},"CW202401","CW202401003",68.5]
[96,{"$f":"VLOOKUP(C97,[1]Sheet1!$E$7:$F$46,2,0)","v":4000441},"CW202401","CW202401006",68.5]
[97,{"$f":"VLOOKUP(C98,[1]Sheet1!$E$7:$F$46,2,0)","v":4000441},"CW202401","CW202401016",68.5]
[98,{"$f":"VLOOKUP(C99,[1]Sheet1!$E$7:$F$46,2,0)","v":4000441},"CW202401","CW202401018",68.5]
[99,{"$f":"VLOOKUP(C100,[1]Sheet1!$E$7:$F$46,2,0)","v":4000441},"CW202401","CW202401002",68]
[100,{"$f":"VLOOKUP(C101,[1]Sheet1!$E$7:$F$46,2,0)","v":4000441},"CW202401","CW202401012",67.5]
[101,{"$f":"VLOOKUP(C102,[1]Sheet1!$E$7:$F$46,2,0)","v":4000441},"CW202401","CW202401035",66.5]
[102,{"$f":"VLOOKUP(C103,[1]Sheet1!$E$7:$F$46,2,0)","v":4000441},"CW202401","CW202401027",64]
[103,{"$f":"VLOOKUP(C104,[1]Sheet1!$E$7:$F$46,2,0)","v":4000441},"CW202401","CW202401008",62.5]
[104,{"$f":"VLOOKUP(C105,[1]Sheet1!$E$7:$F$46,2,0)","v":4000441},"CW202401","CW202401011",61.5]
[105,{"$f":"VLOOKUP(C106,[1]Sheet1!$E$7:$F$46,2,0)","v":4000441},"CW202401","CW202401019",60]
[106,4000442,"FDY202401","FDY202401018",82.5,"入围专业测试"]
[107,4000442,"FDY202401","FDY202401030",81.5,"入围专业测试"]
[108,4000442,"FDY202401","FDY202401032",80,"入围专业测试"]
[109,4000442,"FDY202401","FDY202401027",79,"入围专业测试"]
[110,4000442,"FDY202401","FDY202401028",78,"入围专业测试"]
[111,4000442,"FDY202401","FDY202401008",76.5,"入围专业测试"]
[112,4000442,"FDY202401","FDY202401045",76.5,"入围专业测试"]
[113,4000442,"FDY202401","FDY202401011",76,"入围专业测试"]
[114,4000442,"FDY202401","FDY202401038",76,"入围专业测试"]
[115,4000442,"FDY202401","FDY202401022",75]
[116,4000442,"FDY202401","FDY202401005",74.5]
[117,4000442,"FDY202401","FDY202401012",74.5]
[118,4000442,"FDY202401","FDY202401023",74.5]
[119,4000442,"FDY202401","FDY202401019",73.5]
[120,4000442,"FDY202401","FDY202401024",73.5]
[121,4000442,"FDY202401","FDY202401025",73.5]
[122,4000442,"FDY202401","FDY202401015",73]
[123,4000442,"FDY202401","FDY202401016",73]
[124,4000442,"FDY202401","FDY202401026",72.5]
[125,4000442,"FDY202401","FDY202401003",72]
[126,4000442,"FDY202401","FDY202401004",72]
[127,4000442,"FDY202401","FDY202401013",72]
[128,4000442,"FDY202401","FDY202401035",72]
[129,4000442,"FDY202401","FDY202401044",72]
[130,4000442,"FDY202401","FDY202401036",71.5]
[131,4000442,"FDY202401","FDY202401002",71]
[132,4000442,"FDY202401","FDY202401033",71]
[133,4000442,"FDY202401","FDY202401041",71]
[134,4000442,"FDY202401","FDY202401014",70.5]
[135,4000442,"FDY202401","FDY202401020",70.5]
[136,4000442,"FDY202401","FDY202401029",70.5]
[137,4000442,"FDY202401","FDY202401039",70.5]
[138,4000442,"FDY202401","FDY202401009",70]
[139,4000442,"FDY202401","FDY202401031",70]
[140,4000442,"FDY202401","FDY202401034",70]
[141,4000442,"FDY202401","FDY202401040",70]
[142,4000442,"FDY202401","FDY202401001",69.5]
[143,4000442,"FDY202401","FDY202401007",69.5]
[144,4000442,"FDY202401","FDY202401006",69]
[145,4000442,"FDY202401","FDY202401037",68.5]
[146,4000442,"FDY202401","FDY202401010",67.5]
[147,4000442,"FDY202401","FDY202401043",67.5]
[148,4000442,"FDY202401","FDY202401017",67]
[149,4000442,"FDY202401","FDY202401021",60]
[150,4000443,"FDY202402","FDY202402042",86,"入围专业测试"]
[151,4000443,"FDY202402","FDY202402049",83.5,"入围专业测试"]
[152,4000443,"FDY202402","FDY202402085",83,"入围专业测试"]
[153,4000443,"FDY202402","FDY202402009",82.5,"入围专业测试"]
[154,4000443,"FDY202402","FDY202402044",80.5,"入围专业测试"]
[155,4000443,"FDY202402","FDY202402003",79.5,"入围专业测试"]
[156,4000443,"FDY202402","FDY202402033",79.5,"入围专业测试"]
[157,4000443,"FDY202402","FDY202402093",79.5,"入围专业测试"]
[158,4000443,"FDY202402","FDY202402099",79.5,"入围专业测试"]
[159,4000443,"FDY202402","FDY202402082",79]
[160,4000443,"FDY202402","FDY202402022",78]
[161,4000443,"FDY202402","FDY202402031",78]
[162,4000443,"FDY202402","FDY202402034",78]
[163,4000443,"FDY202402","FDY202402045",78]
[164,4000443,"FDY202402","FDY202402071",78]
[165,4000443,"FDY202402","FDY202402017",77.5]
[166,4000443,"FDY202402","FDY202402052",77.5]
[167,4000443,"FDY202402","FDY202402089",77.5]
[168,4000443,"FDY202402","FDY202402091",77.5]
[169,4000443,"FDY202402","FDY202402004",77]
[170,4000443,"FDY202402","FDY202402094",77]
[171,4000443,"FDY202402","FDY202402048",76.5]
[172,4000443,"FDY202402","FDY202402058",76.5]
[173,4000443,"FDY202402","FDY202402059",76.5]
[174,4000443,"FDY202402","FDY202402079",76.5]
[175,4000443,"FDY202402","FDY202402015",76]
[176,4000443,"FDY202402","FDY202402027",76]
[177,4000443,"FDY202402","FDY202402061",76]
[178,4000443,"FDY202402","FDY202402084",76]
[179,4000443,"FDY202402","FDY202402095",76]
[180,4000443,"FDY202402","FDY202402018",75.5]
[181,4000443,"FDY202402","FDY202402070",75.5]
[182,4000443,"FDY202402","FDY202402014",75]
[183,4000443,"FDY202402","FDY202402077",75]
[184,4000443,"FDY202402","FDY202402080",75]
[185,4000443,"FDY202402","FDY202402090",74.5]
[186,4000443,"FDY202402","FDY202402096",74.5]
[187,4000443,"FDY202402","FDY202402041",74]
[188,4000443,"FDY202402","FDY202402064",74]
[189,4000443,"FDY202402","FDY202402010",73.5]
[190,4000443,"FDY202402","FDY202402043",73.5]
[191,4000443,"FDY202402","FDY202402065",73.5]
[192,4000443,"FDY202402","FDY202402075",73.5]
[193,4000443,"FDY202402","FDY202402083",73.5]
[194,4000443,"FDY202402","FDY202402026",73]
[195,4000443,"FDY202402","FDY202402046",73]
[196,4000443,"FDY202402","FDY202402101",73]
[197,4000443,"FDY202402","FDY202402006",72]
[198,4000443,"FDY202402","FDY202402069",72]
[199,4000443,"FDY202402","FDY202402011",71.5]
{"$rows_left_out":74}